Versuche gerade ein E2 Image für meine UFS912 zu bauen. Komme aber hier nicht weiter. Vielleicht kann jemand helfen?

Code:
config.status: creating po/Makefile.in
config.status: executing depfiles commands
config.status: executing libtool commands
config.status: executing default-1 commands
config.status: executing bfd_stdint.h commands
config.status: executing default commands
make[4]: Leaving directory `/home/eagle/ufs912/tdt/tdt/cvs/cdk/BUILD/binutils-2.22/objdir/bfd/po'
make[4]: Entering directory `/home/eagle/ufs912/tdt/tdt/cvs/cdk/BUILD/binutils-2.22/objdir/bfd/po'
make[4]: Nothing to be done for `info'.
make[4]: Leaving directory `/home/eagle/ufs912/tdt/tdt/cvs/cdk/BUILD/binutils-2.22/objdir/bfd/po'
make[4]: Entering directory `/home/eagle/ufs912/tdt/tdt/cvs/cdk/BUILD/binutils-2.22/objdir/bfd'
make[4]: Nothing to be done for `info-am'.
make[4]: Leaving directory `/home/eagle/ufs912/tdt/tdt/cvs/cdk/BUILD/binutils-2.22/objdir/bfd'
make[3]: *** [info-recursive] Error 1
make[3]: Leaving directory `/home/eagle/ufs912/tdt/tdt/cvs/cdk/BUILD/binutils-2.22/objdir/bfd'
make[2]: *** [all-bfd] Error 2
make[2]: Leaving directory `/home/eagle/ufs912/tdt/tdt/cvs/cdk/BUILD/binutils-2.22/objdir'
make[1]: *** [all] Error 2
make[1]: Leaving directory `/home/eagle/ufs912/tdt/tdt/cvs/cdk/BUILD/binutils-2.22/objdir'
Fehler: Fehler-Status beim Beenden von /var/tmp/rpm-tmp.m8zrRt (%build)


Fehler beim Bauen des RPM:
    bogus date in %changelog: Tue Jan 16 2013 Christian Bruel <christian.bruel@st.com> 64
    bogus date in %changelog: Wed Jun 16 2011 Christian Bruel <christian.bruel@st.com> 52
    bogus date in %changelog: Fri Jun 16 2010 Ram Dayal<ram.dayal@st.com> 43
    bogus date in %changelog: Fri Jun 01 2010 Ram Dayal<ram.dayal@st.com> 43
    bogus date in %changelog: Tue May 20 2010 Christian Bruel <christian.bruel@st.com> 42
    bogus date in %changelog: Tue Nov 25 2009 Christian Bruel <christian.bruel@st.com> 38
    bogus date in %changelog: Tue Jul 23 2008 Carl Shaw <carl.shaw@st.com> 24
    Fehler-Status beim Beenden von /var/tmp/rpm-tmp.m8zrRt (%build)
make: *** [RPMS/x86_64/stlinux24-cross-sh4-binutils-2.22-64.x86_64.rpm] Fehler 1
eagle@eagle-K73SV:~/ufs912/tdt/tdt/cvs/cdk$